{"text_format":"1","workbook":"xlsx","n_sheets":9,"sheets":["LISEZ-MOI","A RENSEIGNER","POULE DE 3 ","RESULTATS  POULE DE  3","POULE DE 2","RESULTATS POULE DE 2","categories","BD_JOUEURS_CLUB_CATEGORIES","resultats pour ranking"],"not_rendered":{"charts":0,"images":1,"macros":0,"external_links":0,"defined_names":19,"comments":0,"pivot_tables":0},"unopened":[],"bounds":{"document_bytes":16777216,"sheet_cells":100000,"rows_first":2000,"rows_last":500,"rows_between":2000,"halvings":0,"cell_chars":16384,"cell_head_chars":4096},"cells_cut":0,"cells_raw":0,"read":"whole","date_system":"1900"}

{"sheet":"LISEZ-MOI","index":0,"n_rows":41,"n_cols":2,"rows_kept":41,"cut":false,"hidden":false,"merged":[]}
["Ce classeur contient 4 feuilles"]
[]
["1 /  La feuille lisez_-moi vous indique comment utiliser ce classeur"]
[]
["2 / La feuille \" A RENSEIGNER\" vous demande de remplir les cases bleues uniquement mais complètement"]
[]
[null,"la date"]
[null,"le lieu"]
[null,"le nom du Directeur de jeu"]
[null,"le numéro de la poule que vous trouverez en consultant la convocation"]
[]
[null,"POULE DE 3"]
[null,"indiquez le nom des joueurs "]
[null,"ou"]
[null,"POULE DE 2"]
[null,"indiquez le nom des joueurs"]
[]
[null,"cette action remplie  la feuille de poule"]
[]
["3 : la feuille POULE DE 3 se remplit de la façon suivante"]
{"$rows_left_out":22}
{"sheet":"A RENSEIGNER","index":1,"n_rows":186,"n_cols":6,"rows_kept":186,"cut":false,"hidden":false,"merged":[[0,1,0,3],[2,1,2,3],[4,0,4,8],[10,3,10,9],[37,1,37,3],[34,1,34,3],[21,1,21,3],[24,1,24,3],[12,5,16,8],[19,1,19,3]]}
["VERSION 10/2021"]
[]
[]
[]
["CDBVM\n     SAISON  2021- 2022"]
[]
[]
[]
[]
[]
[null,"DATE DE LA COMPETITION   ","2022-03-13",{"$f":"IF(COUNTA(C11:C17)<7,\"RENSEIGNEZ TOUS LES CHAMPS ! MERCI\",\"\")","v":"RENSEIGNEZ TOUS LES CHAMPS ! MERCI"}]
[null,"LIEU   ","ABMA"]
[null,"DIRECTEUR DE JEU   ",null,null,null,"Ce fichier rempli doit être envoyé dès la fin de la compétition à la Commission Sportive à l'adresse de messagerie: csdistrict9394@outlook.fr"]
[null,"TOURNOI N°   ","FINALE"]
[null,"POULE N°   ",1]
[null,"MODE DE JEU    ","LIBRE",null,{"$f":"VLOOKUP(C16,ModeJeu_col,2,0)","v":1}]
[null,"CATEGORIE","N3"]
[]
[]
[null,"CE FICHIER NE SERT QU' A UNE SEULE POULE\n DE 3 JOUEURS OU DE 2 JOUEURS"]
{"$rows_left_out":167}
{"sheet":"POULE DE 3 ","index":2,"n_rows":240,"n_cols":34,"rows_kept":240,"cut":false,"hidden":false,"merged":[[96,192,96,207],[96,128,96,143],[43,15,43,23],[39,2,39,9],[96,208,96,223],[96,48,96,63],[96,64,96,79],[96,80,96,95],[96,96,96,111],[96,176,96,191],[96,160,96,175],[96,112,96,127],[47,15,47,23],[96,144,96,159],[96,32,96,43],[39,20,42,20],[96,0,96,15],[40,2,40,9],[45,15,45,24],[96,16,96,31],[57,3,57,17],[1,2,1,9],[32,2,32,9],[4,5,5,9],[23,15,23,33],[23,2,23,9],[18,2,18,9],[31,27,41,27],[20,2,20,9],[31,26,41,26],[41,15,41,19],[32,15,32,17],[32,19,32,21]]}
[]
[null,null,"CDBVM\n     SAISON  2021- 2022"]
[]
[null,null,{"$f":"'A RENSEIGNER'!B11","v":"DATE DE LA COMPETITION   "},{"$f":"IF(ISBLANK('A RENSEIGNER'!C11),\"\",'A RENSEIGNER'!C11)","v":"2022-03-13"}]
[null,null,{"$f":"'A RENSEIGNER'!B12","v":"LIEU   "},{"$f":"IF(ISBLANK('A RENSEIGNER'!C12),\"\",'A RENSEIGNER'!C12)","v":"ABMA"},null,"FEUILLE DE MATCH\nPOULE DE 3 JOUEURS"]
[null,null,{"$f":"'A RENSEIGNER'!B13","v":"DIRECTEUR DE JEU   "},{"$f":"IF(ISBLANK('A RENSEIGNER'!C13),\"\",'A RENSEIGNER'!C13)","v":""}]
[null,null,{"$f":"'A RENSEIGNER'!B14","v":"TOURNOI N°   "},{"$f":"IF(ISBLANK('A RENSEIGNER'!C14),\"\",'A RENSEIGNER'!C14)","v":"FINALE"}]
[null,null,{"$f":"'A RENSEIGNER'!B15","v":"POULE N°   "},{"$f":"IF(ISBLANK('A RENSEIGNER'!C15),\"\",'A RENSEIGNER'!C15)","v":1}]
[null,null,{"$f":"'A RENSEIGNER'!B16","v":"MODE DE JEU    "},{"$f":"IF(ISBLANK('A RENSEIGNER'!C16),\"\",'A RENSEIGNER'!C16)","v":"LIBRE"}]
[]
[]
[null,null,"JOUEURS","CATEGORIE"]
[]
[null,null,{"$f":"IF(ISBLANK('A RENSEIGNER'!B28),\"\",'A RENSEIGNER'!B28)","v":"JARRETY Didier"},{"$f":"'A RENSEIGNER'!C28","v":"N3"},{"$f":"VLOOKUP(D14,$P$34:$Q$38,2,0)","v":200}]
[null,null,{"$f":"IF(ISBLANK('A RENSEIGNER'!B29),\"\",'A RENSEIGNER'!B29)","v":"SIMON Claude"},{"$f":"'A RENSEIGNER'!C29","v":"N3"},{"$f":"VLOOKUP(D15,$P$34:$Q$38,2,0)","v":200}]
[null,null,{"$f":"IF(ISBLANK('A RENSEIGNER'!B30),\"\",'A RENSEIGNER'!B30)","v":"RIEGEL Serge"},{"$f":"'A RENSEIGNER'!C30","v":"N3"},{"$f":"VLOOKUP(D16,$P$34:$Q$38,2,0)","v":200}]
[]
[]
[null,null,{"$f":"IF(ISBLANK('A RENSEIGNER'!C16),\"\",IF('A RENSEIGNER'!C16=\"3 BANDES\",\"LA DISTANCE DE LA POULE EST DE\"&\" \"&IF(AND(D14=D15=D16),VLOOKUP(D14,P34:Q38,2,0),MAX(E14:E16))&\"  \"&\"POINTS EN 50 REPRISES\",\"LA DISTANCE DE LA POULE EST DE\"&\" \"&IF(AND(D14=D15=D16),VLOOKUP(D14,P34:Q38,2,0),MAX(E14:E16))&\"  \"&\"POINTS SANS LIMITATION DE REPRISES\"))","v":"LA DISTANCE DE LA POULE EST DE 200  POINTS SANS LIMITATION DE REPRISES"}]
[]
{"$rows_left_out":221}
{"sheet":"RESULTATS  POULE DE  3","index":3,"n_rows":28,"n_cols":21,"rows_kept":28,"cut":false,"hidden":false,"merged":[[16,13,16,14],[17,19,19,19],[18,12,18,13],[18,14,18,15],[17,20,19,20],[17,16,19,16],[17,13,17,14],[19,12,19,13],[19,14,19,15],[20,9,20,11],[2,2,2,20],[4,2,4,20],[6,2,6,20],[8,2,8,20],[10,2,10,20],[20,3,20,5],[20,6,20,8],[20,13,20,14],[12,2,12,20],[16,6,16,8],[17,18,19,18],[17,17,19,17],[16,3,16,5],[14,2,14,20],[16,9,16,11],[21,16,23,16],[21,18,23,18],[23,12,23,13],[24,3,24,5],[24,6,24,8],[22,12,22,13],[24,9,24,11],[25,20,27,20],[25,19,27,19],[25,18,27,18],[21,17,23,17],[21,13,21,14],[25,16,27,16],[26,12,26,13],[26,14,26,15],[27,12,27,13],[21,20,23,20],[23,14,23,15],[27,14,27,15],[24,13,24,14],[25,17,27,17],[21,19,23,19],[25,13,25,14]]}
[]
[]
[null,null,{"$f":"'A RENSEIGNER'!$C$11","v":"2022-03-13"}]
[]
[null,null,{"$f":"'A RENSEIGNER'!$C$12","v":"ABMA"}]
[]
[null,null,{"$f":"\"MODE DE JEU\"&\"  \"&'A RENSEIGNER'!$C$16","v":"MODE DE JEU  LIBRE"}]
[]
[null,null,{"$f":"\"CATEGORIE\"&\"  \"&'A RENSEIGNER'!$C$17","v":"CATEGORIE  N3"}]
[]
[null,null,{"$f":"\"TOURNOI N°\"&\"  \"&'A RENSEIGNER'!$C$14","v":"TOURNOI N°  FINALE"}]
[]
[null,null,{"$f":"\"POULE n°\"&\"  \"&'A RENSEIGNER'!$C$15","v":"POULE n°  1"}]
[]
[null,null,"RESULTATS DE LA POULE"]
[]
[null,null,"JOUEUR\ncategorie\nclub",{"$f":"C18","v":"JARRETY Didier"},null,null,{"$f":"C22","v":"SIMON Claude"},null,null,{"$f":"C26","v":"RIEGEL Serge"},null,null,"PTS","REP",null,"MG","PTS DE\n MATCHS","RANG","POINTS DE \nCLASSEMENT","POINTS DE\n BONUS","TOTAL \nPOINTS"]
[null,null,{"$f":"IF(ISBLANK('A RENSEIGNER'!B28),\"\",'A RENSEIGNER'!B28)","v":"JARRETY Didier"},null,null,null,{"$f":"IF(ISBLANK('POULE DE 3 '!E36),\"\",'POULE DE 3 '!E36)","v":200},null,{"$f":"IF(ISBLANK('POULE DE 3 '!F36),\"\",'POULE DE 3 '!F36)","v":36},{"$f":"IF(ISBLANK('POULE DE 3 '!E44),\"\",'POULE DE 3 '!E44)","v":200},null,{"$f":"IF(ISBLANK('POULE DE 3 '!F44),\"\",'POULE DE 3 '!F44)","v":24},{"$f":"IF('POULE DE 3 '!R27=0,\"\",'POULE DE 3 '!R27)","v":400},{"$f":"IF('POULE DE 3 '!S27=0,\"\",'POULE DE 3 '!S27)","v":60},null,{"$f":"IF(ISERROR('POULE DE 3 '!T27),\"\",'POULE DE 3 '!T27)","v":6.666666666666667},{"$f":"IF(ISERROR('POULE DE 3 '!W27),\"\",'POULE DE 3 '!W27)","v":4},{"$f":"IF(ISERROR('POULE DE 3 '!Y27),\"\",IF(ISBLANK('A RENSEIGNER'!B28),\"\",IF('POULE DE 3 '!Y27=1,'POULE DE 3 '!Y27&\"er\",'POULE DE 3 '!Y27&\"ème\")))","v":"1er"},{"$f":"IF(ISERROR('POULE DE 3 '!Z27),\"\",'POULE DE 3 '!Z27)","v":8},{"$f":"IF(ISBLANK(C18),\"\",'POULE DE 3 '!AG27)","v":1},{"$f":"IF(ISERROR('POULE DE 3 '!AH27),\"\",'POULE DE 3 '!AH27)","v":9}]
[null,null,{"$f":"'A RENSEIGNER'!C28","v":"N3"},null,null,null,null,{"$f":"'POULE DE 3 '!J36","v":2},null,null,{"$f":"'POULE DE 3 '!J44","v":2},null,"MP",null,"SERIE"]
[null,null,{"$f":"'A RENSEIGNER'!D28","v":"LIVRY"},null,null,null,{"$f":"+'POULE DE 3 '!I36","v":5.5555555555555554},null,{"$f":"IF(ISBLANK('POULE DE 3 '!G36),\"\",'POULE DE 3 '!G36)","v":25},{"$f":"+'POULE DE 3 '!I44","v":8.3333333333333339},null,{"$f":"IF(ISBLANK('POULE DE 3 '!G44),\"\",'POULE DE 3 '!G44)","v":32},{"$f":"IF('POULE DE 3 '!U27=0,\"\",'POULE DE 3 '!U27)","v":8.3333333333333339},null,{"$f":"IF('POULE DE 3 '!V27=0,\"\",'POULE DE 3 '!V27)","v":32}]
{"$rows_left_out":9}
{"sheet":"POULE DE 2","index":4,"n_rows":230,"n_cols":34,"rows_kept":230,"cut":false,"hidden":false,"merged":[[49,15,49,23],[33,15,33,17],[40,2,40,9],[43,15,43,19],[45,15,45,23],[47,15,47,24],[33,19,33,21],[32,26,43,26],[32,27,43,27],[32,2,32,9],[19,2,19,9],[1,2,1,9],[1,10,1,17],[24,2,24,9],[24,15,24,33],[1,18,1,25],[1,26,1,33],[6,5,7,9],[21,2,21,9],[2,2,2,9]]}
[]
[null,null,"CDBVM\n     SAISON  2020- 2021",null,null,null,null,null,null,null,null,null,null,null,null,null,null,null,"CDBHS\n     SAISON  2015- 2016",null,null,null,null,null,null,null,"CDBHS\n     SAISON  2015- 2016"]
[]
[]
[null,null,{"$f":"'POULE DE 3 '!C4","v":"DATE DE LA COMPETITION   "},{"$f":"'POULE DE 3 '!D4","v":"2022-03-13"}]
[null,null,{"$f":"'POULE DE 3 '!C5","v":"LIEU   "},{"$f":"'POULE DE 3 '!D5","v":"ABMA"}]
[null,null,{"$f":"'POULE DE 3 '!C6","v":"DIRECTEUR DE JEU   "},{"$f":"'POULE DE 3 '!D6","v":""},null,"FEUILLE DE MATCH\nPOULE DE 2 JOUEURS"]
[null,null,{"$f":"'A RENSEIGNER'!B14","v":"TOURNOI N°   "},{"$f":"'POULE DE 3 '!D7","v":"FINALE"}]
[null,null,{"$f":"'POULE DE 3 '!C8","v":"POULE N°   "},{"$f":"'POULE DE 3 '!D8","v":1}]
[null,null,{"$f":"'POULE DE 3 '!C9","v":"MODE DE JEU    "},{"$f":"'POULE DE 3 '!D9","v":"LIBRE"}]
[]
[]
[null,null,"JOUEURS","CATEGORIE"]
[]
[null,null,{"$f":"IF(ISBLANK('A RENSEIGNER'!B41),\"\",'A RENSEIGNER'!B41)","v":""},{"$f":"'A RENSEIGNER'!C41","v":""},{"$f":"VLOOKUP(D15,P35:Q39,2,0)","v":{"$error":"#N/A"}}]
[null,null,{"$f":"IF(ISBLANK('A RENSEIGNER'!B42),\"\",'A RENSEIGNER'!B42)","v":""},{"$f":"'A RENSEIGNER'!C42","v":""},{"$f":"VLOOKUP(D16,P36:Q40,2,0)","v":{"$error":"#N/A"}}]
[]
[]
[]
[null,null,{"$f":"IF(ISBLANK('A RENSEIGNER'!C16),\"\",IF('A RENSEIGNER'!C16=\"3 BANDES\",\"LA DISTANCE DE LA POULE EST DE\"&\" \"&IF(AND(D15=D16),VLOOKUP(D15,P35:Q39,2,0),MAX(E15:E16))&\"  \"&\"POINTS EN 60 REPRISES\",\"LA DISTANCE DE LA POULE EST DE\"&\" \"&IF(AND(D15=D16),VLOOKUP(D15,P35:Q39,2,0),MAX(E15:E16))&\"  \"&\"POINTS EN 30 REPRISES\"))","v":{"$error":"#N/A"}}]
{"$rows_left_out":211}
{"sheet":"RESULTATS POULE DE 2","index":5,"n_rows":24,"n_cols":21,"rows_kept":24,"cut":false,"hidden":false,"merged":[[21,16,23,16],[21,17,23,17],[18,12,18,13],[18,14,18,15],[21,20,23,20],[22,12,22,13],[23,12,23,13],[17,20,19,20],[21,19,23,19],[23,14,23,15],[20,13,20,14],[17,19,19,19],[21,13,21,14],[21,18,23,18],[2,2,2,20],[16,3,16,5],[16,6,16,8],[16,9,16,11],[16,13,16,14],[8,2,8,20],[6,2,6,20],[20,3,20,5],[4,2,4,20],[10,2,10,20],[14,2,14,20],[12,2,12,20],[19,12,19,13],[19,14,19,15],[17,18,19,18],[17,17,19,17],[17,13,17,14],[17,16,19,16],[20,6,20,8],[20,9,20,11]]}
[]
[]
[null,null,{"$f":"'A RENSEIGNER'!$C$11","v":"2022-03-13"}]
[]
[null,null,{"$f":"'A RENSEIGNER'!$C$12","v":"ABMA"}]
[]
[null,null,{"$f":"\"MODE DE JEU\"&\"  \"&'A RENSEIGNER'!$C$16","v":"MODE DE JEU  LIBRE"}]
[]
[null,null,{"$f":"\"CATEGORIE\"&\"  \"&'A RENSEIGNER'!$C$17","v":"CATEGORIE  N3"}]
[]
[null,null,{"$f":"\"TOURNOI N°\"&\"  \"&'A RENSEIGNER'!$C$14","v":"TOURNOI N°  FINALE"}]
[]
[null,null,{"$f":"\"POULE n°\"&\"  \"&'A RENSEIGNER'!$C$15","v":"POULE n°  1"}]
[]
[null,null,"RESULTATS DE LA POULE"]
[]
[null,null,"JOUEUR\ncategorie\nclub",{"$f":"C18","v":""},null,null,{"$f":"C22&\"  \"&\"match 1\"","v":"  match 1"},null,null,{"$f":"C22&\"  \"&\"match 2\"","v":"  match 2"},null,null,"PTS","REP",null,"MG","PTS DE\n MATCHS","RANG","POINTS DE \nCLASSEMENT","POINTS DE\n BONUS","TOTAL \nPOINTS"]
[null,null,{"$f":"IF(ISBLANK('A RENSEIGNER'!B41),\"\",('A RENSEIGNER'!B41))","v":""},null,null,null,{"$f":"IF(ISBLANK('POULE DE 2'!E28),\"\",'POULE DE 2'!E28)","v":""},null,{"$f":"IF(ISBLANK('POULE DE 2'!F28),\"\",'POULE DE 2'!F28)","v":""},{"$f":"IF(ISBLANK('POULE DE 2'!E36),\"\",'POULE DE 2'!E36)","v":""},null,{"$f":"IF(ISBLANK('POULE DE 2'!E36),\"\",'POULE DE 2'!F36)","v":""},{"$f":"IF('POULE DE 2'!R28=0,\"\",'POULE DE 2'!R28)","v":""},{"$f":"IF('POULE DE 2'!S28=0,\"\",'POULE DE 2'!S28)","v":""},null,{"$f":"IF(ISERROR('POULE DE 2'!T28),\"\",'POULE DE 2'!T28)","v":""},{"$f":"IF(ISERROR('POULE DE 3 '!W28),\"\",'POULE DE 2'!W28)","v":""},{"$f":"IF(ISERROR('POULE DE 3 '!Y28),\"\",IF(ISBLANK('A RENSEIGNER'!B41),\"\",IF('POULE DE 2'!Y28=1,'POULE DE 2'!Y28&\"er\",'POULE DE 2'!Y28&\"ème\")))","v":""},{"$f":"IF(ISERROR('POULE DE 3 '!Z28),\"\",'POULE DE 2'!Z28)","v":""},{"$f":"IF(ISBLANK(C18),\"\",'POULE DE 2'!AG28)","v":""},{"$f":"IF(ISERROR('POULE DE 2'!AH28),\"\",'POULE DE 2'!AH28)","v":""}]
[null,null,{"$f":"'A RENSEIGNER'!C41","v":""},null,null,null,null,{"$f":"'POULE DE 2'!J28","v":""},null,null,{"$f":"'POULE DE 2'!J36","v":""},null,"MP",null,"SERIE"]
[null,null,{"$f":"'A RENSEIGNER'!D41","v":""},null,null,null,{"$f":"'POULE DE 2'!I28","v":""},null,{"$f":"IF(ISBLANK('POULE DE 2'!G28),\"\",'POULE DE 2'!G28)","v":""},{"$f":"'POULE DE 2'!I36","v":""},null,{"$f":"IF(ISBLANK('POULE DE 2'!E36),\"\",'POULE DE 2'!G36)","v":""},{"$f":"IF('POULE DE 2'!U28=0,\"\",'POULE DE 2'!U28)","v":""},null,{"$f":"IF('POULE DE 2'!V28=0,\"\",'POULE DE 2'!V28)","v":""}]
{"$rows_left_out":5}
{"sheet":"categories","index":6,"n_rows":24,"n_cols":11,"rows_kept":24,"cut":false,"hidden":true,"merged":[]}
["version excel",null," 2016_CDBHS_FM_v9"]
["non trouvé",null,"-"]
[]
["distance","jeux","TABLEAU DES DISTANCES LIBRE","pt","f",null,"moyenne","jeux","MOYENNE DES CATEGORIES LIBRE ","mini","maxi"]
[{"$f":"B5&C5","v":"3 BANDESN3"},"3 BANDES","N3",25,"60 REP",null,{"$f":"H5&I5","v":"3 BANDESN3"},"3 BANDES","N3",0.36,0.52299989999999996]
[{"$f":"B6&C6","v":"3 BANDESR1"},"3 BANDES","R1",20,"60 REP",null,{"$f":"H6&I6","v":"3 BANDESR1"},"3 BANDES","R1",0.25,0.35999989999999998]
["3 BANDESR2","3 BANDES","R2",15,"60 REP",null,"3 BANDESR2","3 BANDES","R2",0,0.249999]
["3 BANDESR3","3 BANDES","R3","-","-",null,"3 BANDESR3","3 BANDES","R3","-","-"]
["3 BANDESR4","3 BANDES","R4","-","-",null,"3 BANDESR4","3 BANDES","R4","-","-"]
["BANDEN3","BANDE","N3",80,null,null,"BANDEN3","BANDE","N3",1.75,2.5799998999999998]
["BANDER1","BANDE","R1",60,null,null,"BANDER1","BANDE","R1",1,1.7499998999999999]
["BANDER2","BANDE","R2",40,null,null,"BANDER2","BANDE","R2",0,0.99999990000000005]
["BANDER3","BANDE","R3","-","-",null,"BANDER3","BANDE","R3","-","-"]
["BANDER4","BANDE","R4","-","-",null,"BANDER4","BANDE","R4","-","-"]
["CADREN3","CADRE","N3",120,"42/2",null,"CADREN3","CADRE","N3",3.5,6.2499998999999997]
["CADRER1","CADRE","R1",80,"42/2",null,"CADRER1","CADRE","R1",0,3.4999999989999999]
["CADRER2","CADRE","R2","-","-",null,"CADRER2","CADRE","R2","-","-"]
["CADRER3","CADRE","R3","-","-",null,"CADRER3","CADRE","R3","-","-"]
["CADRER4","CADRE","R4","-","-",null,"CADRER4","CADRE","R4","-","-"]
["LIBREN3","LIBRE","N3",200,"GC",null,"LIBREN3","LIBRE","N3",6,12.499999900000001]
{"$rows_left_out":5}
{"sheet":"BD_JOUEURS_CLUB_CATEGORIES","index":7,"n_rows":95,"n_cols":12,"rows_kept":95,"cut":false,"hidden":false,"merged":[[1,0,2,0],[1,1,2,1],[1,2,2,2]]}
[null,null,null,1,2,3,4]
["NOM","CLUB","ID","               CATEGORIES"]
[null,null,null,"libre","bande","3 bandes","cadre","n-2"]
["ADMONT Jean-Pierre","ABMA",1,"R2","R1","N3",null,1]
["ARGIS Mickael","ABMA",2,"R1","N3",null,"N3",1]
["BAURECHE Louis","ABASM",3,"R3","R1",null,null,0]
["BEAUCHER Alain","LIVRY",4,"R2","N3","N3","R1",1]
["BENDAYAN Jacky","ABMA",5,"R3",null,"N3","R1",1]
["BOISSET Jean-Pierre","ABASM",6,"R3","R1","R1","R1",1]
["CHAMPY Philippe","ABASM",7,"R2","R1",null,"R1",1]
["CHUNG Hoan Toan","LIVRY",8,"R3","R1","R1","R1",0]
["COKAL Recep","ABASM",9,null,null,"R1","R1",0]
["COURATIN Jean-Daniel","ABMA",10,"R3",null,null,null,1]
["CROLARD Ivan","ABASM",11,"R3",null,null,null,0]
["DAIRE Eric","ABASM",12,"R2","R1","R1","R1",1]
["DECLUNDER Magali",null,13,null,null,"N3",null,0]
["DELALANDE Christian","LIVRY",14,"N3","N3","N3","N3",1]
["DELALANDE Guy","ABMA",15,null,"R2",null,null,0]
["DELAPLACE Emmanuel","LIVRY",16,"R2","R1","N3","R1",1]
["DI GIOIA Serge","ABASM",17,null,null,"R1"," ",1]
{"$rows_left_out":76}
{"sheet":"resultats pour ranking","index":8,"n_rows":22,"n_cols":8,"rows_kept":22,"cut":false,"hidden":false,"merged":[[10,0,10,5],[18,0,18,5],[8,0,8,5]]}
[{"$f":"'A RENSEIGNER'!$C$11","v":"2022-03-13"}]
[{"$f":"'A RENSEIGNER'!$C$12","v":"ABMA"}]
[{"$f":"\"MODE DE JEU\"&\"  \"&'A RENSEIGNER'!$C$16","v":"MODE DE JEU  LIBRE"}]
[{"$f":"\"CATEGORIE\"&\"  \"&'A RENSEIGNER'!$C$17","v":"CATEGORIE  N3"}]
[{"$f":"\"TOURNOI N°\"&\"  \"&'A RENSEIGNER'!$C$14","v":"TOURNOI N°  FINALE"}]
[{"$f":"\"POULE n°\"&\"  \"&'A RENSEIGNER'!$C$15","v":"POULE n°  1"}]
[]
[]
["RESULTATS DE LA POULE"]
[]
["Poule de 3 joueurs"]
["NOM","points de classement ranking","total points","total reprises","Meilleure Particulière","Meilleure série"]
[{"$f":"'RESULTATS  POULE DE  3'!$C$18","v":"JARRETY Didier"},{"$f":"'RESULTATS  POULE DE  3'!$U$18","v":9},{"$f":"'RESULTATS  POULE DE  3'!$M$18","v":400},{"$f":"'RESULTATS  POULE DE  3'!$N$18","v":60},{"$f":"'RESULTATS  POULE DE  3'!$M$20","v":8.3333333333333339},{"$f":"'RESULTATS  POULE DE  3'!$O$20","v":32}]
[{"$f":"'RESULTATS  POULE DE  3'!$C$22","v":"SIMON Claude"},{"$f":"'RESULTATS  POULE DE  3'!$U$22","v":3},{"$f":"'RESULTATS  POULE DE  3'!$M$22","v":270},{"$f":"'RESULTATS  POULE DE  3'!$N$22","v":64},{"$f":"'RESULTATS  POULE DE  3'!$M$24","v":""},{"$f":"'RESULTATS  POULE DE  3'!$O$24","v":21}]
[{"$f":"'RESULTATS  POULE DE  3'!$C$26","v":"RIEGEL Serge"},{"$f":"'RESULTATS  POULE DE  3'!$U$26","v":6},{"$f":"'RESULTATS  POULE DE  3'!$M$26","v":261},{"$f":"'RESULTATS  POULE DE  3'!$N$26","v":52},{"$f":"'RESULTATS  POULE DE  3'!$M$28","v":7.1428571428571432},{"$f":"'RESULTATS  POULE DE  3'!$O$28","v":30}]
[]
[null,null,null,null,null,null,null,"Copier les cellules et coller dans le ranking avec \" valeur\""]
[]
["Poule de 2 joueurs"]
["NOM","points de classement ranking","total points","total reprises","Meilleure Particulière","Meilleure série"]
{"$rows_left_out":2}